Target
Cathepsin K
Ligand
BDBM50137815
Substrate
Meas. Tech.
ChEBML_45546
IC50
370±n/a nM
Citation
 Catalano, JGDeaton, DNFurfine, ESHassell, AMMcFadyen, RBMiller, ABMiller, LRShewchuk, LMWillard, DHWright, LL Exploration of the P1 SAR of aldehyde cathepsin K inhibitors. Bioorg Med Chem Lett 14:275-8 (2003)  
Target
Name:
Cathepsin K
Synonyms:
CATK_HUMAN CTSO Cathepsin O Cathepsin X
Type:
Enzyme
Mol. Mass.:
36975.68
Organism:
Homo sapiens (Human)
Description:
P43235
Residue:
329
  
Inhibitor
Name:
BDBM50137815
Synonyms:
((S)-2-tert-Butoxycarbonylamino-3-oxo-propyl)-carbamic acid methyl ester | CHEMBL318817
Type:
Small organic molecule
Emp. Form.:
C10H18N2O5
Mol. Mass.:
246.2603
SMILES:
COC(=O)NC[C@H](NC(=O)OC(C)(C)C)C=O
: