Target
Cathepsin K
Ligand
BDBM50137817
Substrate
Meas. Tech.
ChEBML_45546
IC50
41±n/a nM
Citation
 Catalano, JGDeaton, DNFurfine, ESHassell, AMMcFadyen, RBMiller, ABMiller, LRShewchuk, LMWillard, DHWright, LL Exploration of the P1 SAR of aldehyde cathepsin K inhibitors. Bioorg Med Chem Lett 14:275-8 (2003)  
Target
Name:
Cathepsin K
Synonyms:
CATK_HUMAN CTSO Cathepsin O Cathepsin X
Type:
Enzyme
Mol. Mass.:
36975.68
Organism:
Homo sapiens (Human)
Description:
P43235
Residue:
329
  
Inhibitor
Name:
BDBM50137817
Synonyms:
CHEMBL92971 | [(S)-1-Formyl-5-(2,2,2-trifluoro-acetylamino)-pentyl]-carbamic acid tert-butyl ester
Type:
Small organic molecule
Emp. Form.:
C13H21F3N2O4
Mol. Mass.:
326.312
SMILES:
CC(C)(C)OC(=O)N[C@@H](CCCCNC(=O)C(F)(F)F)C=O
: