Target
Cathepsin K
Ligand
BDBM50137821
Substrate
Meas. Tech.
ChEBML_45546
IC50
15±n/a nM
Citation
 Catalano, JGDeaton, DNFurfine, ESHassell, AMMcFadyen, RBMiller, ABMiller, LRShewchuk, LMWillard, DHWright, LL Exploration of the P1 SAR of aldehyde cathepsin K inhibitors. Bioorg Med Chem Lett 14:275-8 (2003)  
Target
Name:
Cathepsin K
Synonyms:
CATK_HUMAN CTSO Cathepsin O Cathepsin X
Type:
Enzyme
Mol. Mass.:
36975.68
Organism:
Homo sapiens (Human)
Description:
P43235
Residue:
329
  
Inhibitor
Name:
BDBM50137821
Synonyms:
((S)-5-tert-Butoxycarbonylamino-6-oxo-hexyl)-carbamic acid methyl ester | CHEMBL96284
Type:
Small organic molecule
Emp. Form.:
C13H24N2O5
Mol. Mass.:
288.3401
SMILES:
COC(=O)NCCCC[C@H](NC(=O)OC(C)(C)C)C=O
: