Target
Cathepsin K
Ligand
BDBM50137824
Substrate
Meas. Tech.
ChEBML_45546
IC50
15±n/a nM
Citation
 Catalano, JGDeaton, DNFurfine, ESHassell, AMMcFadyen, RBMiller, ABMiller, LRShewchuk, LMWillard, DHWright, LL Exploration of the P1 SAR of aldehyde cathepsin K inhibitors. Bioorg Med Chem Lett 14:275-8 (2003)  
Target
Name:
Cathepsin K
Synonyms:
CATK_HUMAN CTSO Cathepsin O Cathepsin X
Type:
Enzyme
Mol. Mass.:
36975.68
Organism:
Homo sapiens (Human)
Description:
P43235
Residue:
329
  
Inhibitor
Name:
BDBM50137824
Synonyms:
((S)-1-Formyl-4-phenyl-butyl)-carbamic acid tert-butyl ester | CHEMBL315651
Type:
Small organic molecule
Emp. Form.:
C16H23NO3
Mol. Mass.:
277.3587
SMILES:
CC(C)(C)OC(=O)N[C@@H](CCCc1ccccc1)C=O
: