Target
Calcium and integrin-binding protein 1
Ligand
BDBM50572330
Substrate
Meas. Tech.
ChEMBL_2116701 (CHEMBL4825642)
IC50
59±n/a nM
Citation
 Haberman, VAFleming, SRLeisner, TMPuhl, ACFeng, EXie, LChen, XGoto, YSuga, HParise, LVKireev, DPearce, KHBowers, AA Discovery and Development of Cyclic Peptide Inhibitors of CIB1. ACS Med Chem Lett 12:1832-1839 (2021)  
Target
Name:
Calcium and integrin-binding protein 1
Synonyms:
CIB CIB1_HUMAN Calcium- and integrin-binding protein KIP | PRKDCIP
Type:
PROTEIN
Mol. Mass.:
21691.54
Organism:
Homo sapiens
Description:
ChEMBL_120467
Residue:
191
  
Inhibitor
Name:
BDBM50572330
Synonyms:
CHEMBL4854255
Type:
Small organic molecule
Emp. Form.:
C78H103N17O16S
Mol. Mass.:
1566.822
SMILES:
CC[C@H](C)[C@@H]1NC(=O)[C@H](CC(C)C)NC(=O)[C@H](Cc2c[nH]c3ccccc23)N(C)C(=O)[C@H](Cc2ccc(O)cc2)NC(=O)[C@@H]2CCCN2C(=O)[C@H](CCC(N)=O)NC(=O)[C@H](CCCCN)NC(=O)[C@H](Cc2ccc(O)cc2)NC(=O)CSC[C@H](NC(=O)[C@H](Cc2c[nH]c3ccccc23)NC(=O)[C@H](CC(N)=O)NC1=O)C(N)=O
: