Target
Vasopressin V2 receptor
Ligand
BDBM50137951
Substrate
Meas. Tech.
ChEBML_214714
IC50
80±n/a nM
Citation
 Cho, HMurakami, KNakanishi, HFujisawa, AIsoshima, HNiwa, MHayakawa, KHase, YUchida, IWatanabe, HWakitani, KAisaka, K Synthesis and structure-activity relationships of 5,6,7,8-tetrahydro-4H-thieno[3,2-b]azepine derivatives: novel arginine vasopressin antagonists. J Med Chem 47:101-9 (2003)  
Target
Name:
Vasopressin V2 receptor
Synonyms:
ADHR AVPR2 DIR Renal-type arginine vasopressin receptor V2R_HUMAN Vasopressin V2 receptor | Vasopressin receptor
Type:
Receptor
Mol. Mass.:
40295.28
Organism:
Homo sapiens (Human)
Description:
P30518
Residue:
371
  
Inhibitor
Name:
BDBM50137951
Synonyms:
Biphenyl-2-carboxylic acid [2-{4-[(2-dimethylamino-ethyl)-methyl-amino]-butoxy}-4-(5,6,7,8-tetrahydro-thieno[3,2-b]azepine-4-carbonyl)-phenyl]-amide | CHEMBL177248
Type:
Small organic molecule
Emp. Form.:
C37H44N4O3S
Mol. Mass.:
624.835
SMILES:
CN(C)CCN(C)CCCCOc1cc(ccc1NC(=O)c1ccccc1-c1ccccc1)C(=O)N1CCCCc2sccc12
: