Target
Vasopressin V2 receptor
Ligand
BDBM50137955
Substrate
Meas. Tech.
ChEBML_215011
IC50
10±n/a nM
Citation
 Cho, HMurakami, KNakanishi, HFujisawa, AIsoshima, HNiwa, MHayakawa, KHase, YUchida, IWatanabe, HWakitani, KAisaka, K Synthesis and structure-activity relationships of 5,6,7,8-tetrahydro-4H-thieno[3,2-b]azepine derivatives: novel arginine vasopressin antagonists. J Med Chem 47:101-9 (2003)  
Target
Name:
Vasopressin V2 receptor
Synonyms:
AVPR V2 Avpr2 V2R_RAT Vasopressin receptor
Type:
G-protein coupled receptor
Mol. Mass.:
40761.85
Organism:
Rattus norvegicus (Rat)
Description:
Residue:
371
  
Inhibitor
Name:
BDBM50137955
Synonyms:
Biphenyl-2-carboxylic acid [4-(8-dimethylamino-5,6,7,8-tetrahydro-thieno[3,2-b]azepine-4-carbonyl)-2-methoxy-phenyl]-amide | CHEMBL175212
Type:
Small organic molecule
Emp. Form.:
C31H31N3O3S
Mol. Mass.:
525.661
SMILES:
COc1cc(ccc1NC(=O)c1ccccc1-c1ccccc1)C(=O)N1CCCC(N(C)C)c2sccc12
: