Target
Vasopressin V2 receptor
Ligand
BDBM50137942
Substrate
Meas. Tech.
ChEBML_215011
IC50
20±n/a nM
Citation
 Cho, HMurakami, KNakanishi, HFujisawa, AIsoshima, HNiwa, MHayakawa, KHase, YUchida, IWatanabe, HWakitani, KAisaka, K Synthesis and structure-activity relationships of 5,6,7,8-tetrahydro-4H-thieno[3,2-b]azepine derivatives: novel arginine vasopressin antagonists. J Med Chem 47:101-9 (2003)  
Target
Name:
Vasopressin V2 receptor
Synonyms:
AVPR V2 Avpr2 V2R_RAT Vasopressin receptor
Type:
G-protein coupled receptor
Mol. Mass.:
40761.85
Organism:
Rattus norvegicus (Rat)
Description:
Residue:
371
  
Inhibitor
Name:
BDBM50137942
Synonyms:
Biphenyl-2-carboxylic acid [2-(4-[1,4']bipiperidinyl-1'-yl-4-oxo-butoxy)-4-(5,6,7,8-tetrahydro-thieno[3,2-b]azepine-4-carbonyl)-phenyl]-amide | CHEMBL368353
Type:
Small organic molecule
Emp. Form.:
C42H48N4O4S
Mol. Mass.:
704.92
SMILES:
O=C(CCCOc1cc(ccc1NC(=O)c1ccccc1-c1ccccc1)C(=O)N1CCCCc2sccc12)N1CCC(CC1)N1CCCCC1
: