Target
Inhibitor of nuclear factor kappa-B kinase subunit alpha
Ligand
BDBM50138386
Substrate
Meas. Tech.
ChEBML_90391
IC50
1698±n/a nM
Citation
 Bingham, AHDavenport, RJGowers, LKnight, RLLowe, COwen, DAParry, DMPitt, WR A novel series of potent and selective IKK2 inhibitors. Bioorg Med Chem Lett 14:409-12 (2003)  
Target
Name:
Inhibitor of nuclear factor kappa-B kinase subunit alpha
Synonyms:
CHUK I-kappa-B kinase 1 IKK-A IKK1 IKKA IkBKA Inhibitor of NF-kappa-B kinase alpha/beta Nuclear factor NF-kappa-B inhibitor kinase alpha TCF16 | Transcription factor 16
Type:
PROTEIN
Mol. Mass.:
84642.21
Organism:
Homo sapiens (Human)
Description:
ChEMBL_327453
Residue:
745
  
Inhibitor
Name:
BDBM50138386
Synonyms:
1-[5-(4-{4-[4-(Piperazine-1-sulfonyl)-phenyl]-pyrimidin-2-ylamino}-phenyl)-benzofuran-2-yl]-ethanone | CHEMBL335949
Type:
Small organic molecule
Emp. Form.:
C30H27N5O4S
Mol. Mass.:
553.631
SMILES:
CC(=O)c1cc2cc(ccc2o1)-c1ccc(Nc2nccc(n2)-c2ccc(cc2)S(=O)(=O)N2CCNCC2)cc1
: