Target
Inhibitor of nuclear factor kappa-B kinase subunit alpha
Ligand
BDBM50138395
Substrate
Meas. Tech.
ChEBML_90391
IC50
1175±n/a nM
Citation
 Bingham, AHDavenport, RJGowers, LKnight, RLLowe, COwen, DAParry, DMPitt, WR A novel series of potent and selective IKK2 inhibitors. Bioorg Med Chem Lett 14:409-12 (2003)  
Target
Name:
Inhibitor of nuclear factor kappa-B kinase subunit alpha
Synonyms:
CHUK I-kappa-B kinase 1 IKK-A IKK1 IKKA IkBKA Inhibitor of NF-kappa-B kinase alpha/beta Nuclear factor NF-kappa-B inhibitor kinase alpha TCF16 | Transcription factor 16
Type:
PROTEIN
Mol. Mass.:
84642.21
Organism:
Homo sapiens (Human)
Description:
ChEMBL_327453
Residue:
745
  
Inhibitor
Name:
BDBM50138395
Synonyms:
CHEMBL133928 | Phenyl-{4-[4-(piperazine-1-sulfonyl)-phenyl]-pyrimidin-2-yl}-amine
Type:
Small organic molecule
Emp. Form.:
C20H21N5O2S
Mol. Mass.:
395.478
SMILES:
O=S(=O)(N1CCNCC1)c1ccc(cc1)-c1ccnc(Nc2ccccc2)n1
: