Target
Inhibitor of nuclear factor kappa-B kinase subunit beta
Ligand
BDBM50138393
Substrate
Meas. Tech.
ChEBML_90505
IC50
66±n/a nM
Citation
 Bingham, AHDavenport, RJGowers, LKnight, RLLowe, COwen, DAParry, DMPitt, WR A novel series of potent and selective IKK2 inhibitors. Bioorg Med Chem Lett 14:409-12 (2003)  
Target
Name:
Inhibitor of nuclear factor kappa-B kinase subunit beta
Synonyms:
I-kappa-B Kinase 2 (IKK-beta) I-kappa-B-kinase beta IKBKB IKK-beta IKK2/IKK1 IKKB_HUMAN Inhibitor of nuclear factor kappa B kinase beta subunit Nuclear factor NF-kappa-B inhibitor kinase beta
Type:
Serine/threonine-protein kinase
Mol. Mass.:
86554.39
Organism:
Homo sapiens (Human)
Description:
GST-tagged IKK-2 was expressed in High Five cells and purified.
Residue:
756
  
Inhibitor
Name:
BDBM50138393
Synonyms:
(4-Nitro-phenyl)-{4-[4-(piperazine-1-sulfonyl)-phenyl]-pyrimidin-2-yl}-amine | CHEMBL334758
Type:
Small organic molecule
Emp. Form.:
C20H20N6O4S
Mol. Mass.:
440.476
SMILES:
[O-][N+](=O)c1ccc(Nc2nccc(n2)-c2ccc(cc2)S(=O)(=O)N2CCNCC2)cc1
: