Target
Inhibitor of nuclear factor kappa-B kinase subunit beta
Ligand
BDBM50138383
Substrate
Meas. Tech.
ChEBML_90505
IC50
145±n/a nM
Citation
 Bingham, AHDavenport, RJGowers, LKnight, RLLowe, COwen, DAParry, DMPitt, WR A novel series of potent and selective IKK2 inhibitors. Bioorg Med Chem Lett 14:409-12 (2003)  
Target
Name:
Inhibitor of nuclear factor kappa-B kinase subunit beta
Synonyms:
I-kappa-B Kinase 2 (IKK-beta) I-kappa-B-kinase beta IKBKB IKK-beta IKK2/IKK1 IKKB_HUMAN Inhibitor of nuclear factor kappa B kinase beta subunit Nuclear factor NF-kappa-B inhibitor kinase beta
Type:
Serine/threonine-protein kinase
Mol. Mass.:
86554.39
Organism:
Homo sapiens (Human)
Description:
GST-tagged IKK-2 was expressed in High Five cells and purified.
Residue:
756
  
Inhibitor
Name:
BDBM50138383
Synonyms:
CHEMBL132942 | {4-[4-(Piperazine-1-sulfonyl)-phenyl]-pyrimidin-2-yl}-(3,4,5-trimethoxy-phenyl)-amine
Type:
Small organic molecule
Emp. Form.:
C23H27N5O5S
Mol. Mass.:
485.556
SMILES:
COc1cc(Nc2nccc(n2)-c2ccc(cc2)S(=O)(=O)N2CCNCC2)cc(OC)c1OC
: