Target
Inhibitor of nuclear factor kappa-B kinase subunit beta
Ligand
BDBM50138398
Substrate
Meas. Tech.
ChEBML_90505
IC50
60±n/a nM
Citation
 Bingham, AHDavenport, RJGowers, LKnight, RLLowe, COwen, DAParry, DMPitt, WR A novel series of potent and selective IKK2 inhibitors. Bioorg Med Chem Lett 14:409-12 (2003)  
Target
Name:
Inhibitor of nuclear factor kappa-B kinase subunit beta
Synonyms:
I-kappa-B Kinase 2 (IKK-beta) I-kappa-B-kinase beta IKBKB IKK-beta IKK2/IKK1 IKKB_HUMAN Inhibitor of nuclear factor kappa B kinase beta subunit Nuclear factor NF-kappa-B inhibitor kinase beta
Type:
Serine/threonine-protein kinase
Mol. Mass.:
86554.39
Organism:
Homo sapiens (Human)
Description:
GST-tagged IKK-2 was expressed in High Five cells and purified.
Residue:
756
  
Inhibitor
Name:
BDBM50138398
Synonyms:
(4-Benzothiazol-6-yl-phenyl)-{4-[4-(piperazine-1-sulfonyl)-phenyl]-pyrimidin-2-yl}-amine | CHEMBL129981
Type:
Small organic molecule
Emp. Form.:
C27H24N6O2S2
Mol. Mass.:
528.648
SMILES:
O=S(=O)(N1CCNCC1)c1ccc(cc1)-c1ccnc(Nc2ccc(cc2)-c2ccc3ncsc3c2)n1
: