Target
Ectonucleotide pyrophosphatase/phosphodiesterase family member 2
Ligand
BDBM50572947
Substrate
Meas. Tech.
ChEMBL_2118581 (CHEMBL4827647)
IC50
1.000000±n/a nM
Citation
 Ma, BZhang, LSun, LXin, ZKumaravel, GMarcotte, DChodaparambil, JVWang, QWehr, AJing, JHong, VSWang, THuang, CShao, ZMi, S Discovery of Potent Selective Nonzinc Binding Autotaxin Inhibitor BIO-32546. ACS Med Chem Lett 12:1124-1129 (2021)  
Target
Name:
Ectonucleotide pyrophosphatase/phosphodiesterase family member 2
Synonyms:
ATX Autotaxin (ATX) ENPP2 Ectonucleotide Pyrophosphatase/Phosphodiesterase 2 (ENPP2) Extracellular lysophospholipase D PDNP2
Type:
Enzyme
Mol. Mass.:
99007.13
Organism:
Homo sapiens (Human)
Description:
Q13822
Residue:
863
  
Inhibitor
Name:
BDBM50572947
Synonyms:
CHEMBL4871014
Type:
Small organic molecule
Emp. Form.:
C28H31F6NO3
Mol. Mass.:
543.5411
SMILES:
C[C@H](N1C2CCC1CC(C2)C(O)=O)c1ccc2ccc(O[C@H]3CC[C@H](CC3)C(F)(F)F)c(c2c1)C(F)(F)F
: