Target
Tyrosine-protein kinase Mer
Ligand
BDBM50573121
Substrate
Meas. Tech.
ChEMBL_2119091 (CHEMBL4828157)
IC50
32±n/a nM
Target
Name:
Tyrosine-protein kinase Mer
Synonyms:
MER MERTK Proto-oncogene c-Mer Receptor tyrosine kinase MerTK | Tyrosine-protein kinase Mer
Type:
PROTEIN
Mol. Mass.:
110234.77
Organism:
Homo sapiens (Human)
Description:
ChEMBL_1498723
Residue:
999
  
Inhibitor
Name:
BDBM50573121
Synonyms:
CHEMBL4859554
Type:
Small organic molecule
Emp. Form.:
C24H21N5O2
Mol. Mass.:
411.4558
SMILES:
COc1ccccc1-c1ccc(cc1)-c1nnc(o1)N(C)Cc1ccc2nccn2c1
: