Target
Receptor-type tyrosine-protein kinase FLT3
Ligand
BDBM50573140
Substrate
Meas. Tech.
ChEMBL_2119094 (CHEMBL4828160)
IC50
32±n/a nM
Target
Name:
Receptor-type tyrosine-protein kinase FLT3
Synonyms:
CD135 FL cytokine receptor FLK2 FLT3 Fetal liver kinase-2 Fms-like tyrosine kinase 3 (Flt-3) STK-1 Stem cell tyrosine kinase 1
Type:
Enzyme
Mol. Mass.:
112888.62
Organism:
Homo sapiens (Human)
Description:
P36888
Residue:
993
  
Inhibitor
Name:
BDBM50573140
Synonyms:
CHEMBL4862672
Type:
Small organic molecule
Emp. Form.:
C27H30N8O2
Mol. Mass.:
498.5795
SMILES:
CN(C)C(=O)c1cnc2ccc(CN(C)c3nnc(o3)-c3ccc(cc3C)-c3c(C)nn(C)c3C)cn12
: