Target
Tyrosine-protein kinase receptor UFO
Ligand
BDBM50573149
Substrate
Meas. Tech.
ChEMBL_2119095 (CHEMBL4828161)
IC50
126±n/a nM
Target
Name:
Tyrosine-protein kinase receptor UFO
Synonyms:
AXL TEL/AXL UFO | UFO_HUMAN
Type:
Enzyme
Mol. Mass.:
98316.97
Organism:
Homo sapiens (Human)
Description:
P30530
Residue:
894
  
Inhibitor
Name:
BDBM50573149
Synonyms:
CHEMBL4879167
Type:
Small organic molecule
Emp. Form.:
C31H34N10O
Mol. Mass.:
562.6681
SMILES:
CN(C)Cc1ccc(nc1)-c1cnc2ccc(CN(C)c3nnc(o3)-c3ncc(cc3C)-c3c(C)nn(C)c3C)cn12
: