Target
Receptor-type tyrosine-protein kinase FLT3
Ligand
BDBM50573147
Substrate
Meas. Tech.
ChEMBL_2119096 (CHEMBL4828162)
IC50
<31623±n/a nM
Target
Name:
Receptor-type tyrosine-protein kinase FLT3
Synonyms:
CD135 FL cytokine receptor FLK2 FLT3 Fetal liver kinase-2 Fms-like tyrosine kinase 3 (Flt-3) STK-1 Stem cell tyrosine kinase 1
Type:
Enzyme
Mol. Mass.:
112888.62
Organism:
Homo sapiens (Human)
Description:
P36888
Residue:
993
  
Inhibitor
Name:
BDBM50573147
Synonyms:
CHEMBL4873714
Type:
Small organic molecule
Emp. Form.:
C32H35N9O
Mol. Mass.:
561.68
SMILES:
CN(C)Cc1cccc(c1)-c1cnc2ccc(CN(C)c3nnc(o3)-c3ncc(cc3C)-c3c(C)nn(C)c3C)cn12
: