Target
Nucleosome-remodeling factor subunit BPTF
Ligand
BDBM50573201
Substrate
Meas. Tech.
ChEMBL_2119157 (CHEMBL4828223)
IC50
56±n/a nM
Citation
 Zahid, HBuchholz, CRSingh, MCiccone, MFChan, ANithianantham, SShi, KAihara, HFischer, MSchönbrunn, EDos Santos, COLandry, JWPomerantz, WCK New Design Rules for Developing Potent Cell-Active Inhibitors of the Nucleosome Remodeling Factor (NURF) via BPTF Bromodomain Inhibition. J Med Chem 64:13902-13917 (2021)  
Target
Name:
Nucleosome-remodeling factor subunit BPTF
Synonyms:
BPTF Bromodomain and PHD finger-containing transcription factor FALZ Fetal Alzheimer antigen
Type:
PROTEIN
Mol. Mass.:
338257.07
Organism:
Homo sapiens (Human)
Description:
ChEMBL_107969
Residue:
3046
  
Inhibitor
Name:
BDBM50573201
Synonyms:
CHEMBL4848701
Type:
Small organic molecule
Emp. Form.:
C16H21ClN4O
Mol. Mass.:
320.817
SMILES:
CN(C)CCCc1ccc(Nc2cnn(C)c(=O)c2Cl)cc1
: