Target
Cyclin-T1/Cyclin-dependent kinase 9
Ligand
BDBM50528813
Substrate
Meas. Tech.
ChEMBL_2119653 (CHEMBL4828800)
IC50
193±n/a nM
Citation
 Jiang, BJiang, JKaltheuner, IHIniguez, ABAnand, KFerguson, FMFicarro, SBSeong, BKAGreifenberg, AKDust, SKwiatkowski, NPMarto, JAStegmaier, KZhang, TGeyer, MGray, NS Structure-activity relationship study of THZ531 derivatives enables the discovery of BSJ-01-175 as a dual CDK12/13 covalent inhibitor with efficacy in Ewing sarcoma. Eur J Med Chem 221:0 (2021)  
Target
Name:
Cyclin-T1/Cyclin-dependent kinase 9
Synonyms:
CDK9/ Cyclin-T1 CDK9/Cyclin T Cyclin T1/dependent kinase 9 | Cyclin-Dependent Kinase 9 (CDK9)
Type:
Protein Complex
Mol. Mass.:
Description:
Components:
This complex has 2 components.
Component 1
Name:
Cyclin-T1
Synonyms:
CCNT1 CycT Cyclin T Cyclin-T
Type:
Enzyme Subunit
Mol. Mass.:
80712.40
Organism:
Homo sapiens (Human)
Description:
Residue:
726
  
Component 2
Name:
Cyclin-dependent kinase 9
Synonyms:
C-2K CDK9 Cell division cycle 2-like protein kinase 4 Cyclin-Dependent Kinase 9 (CDK9) Serine/threonine-protein kinase PITALRE Tat-associated kinase complex catalytic subunit
Type:
Enzyme Subunit
Mol. Mass.:
42789.13
Organism:
Homo sapiens (Human)
Description:
Residue:
372
  
Inhibitor
Name:
BDBM50528813
Synonyms:
CHEMBL4163879
Type:
Small organic molecule
Emp. Form.:
C30H32ClN7O2
Mol. Mass.:
558.074
SMILES:
CN(C)C\C=C\C(=O)Nc1ccc(cc1)C(=O)N1CCC[C@H](C1)Nc1ncc(Cl)c(n1)-c1c[nH]c2ccccc12
: