Target
Cyclin-dependent kinase 13/Cyclin-K
Ligand
BDBM50528813
Substrate
Meas. Tech.
ChEMBL_2119655 (CHEMBL4828802)
IC50
657±n/a nM
Citation
 Jiang, BJiang, JKaltheuner, IHIniguez, ABAnand, KFerguson, FMFicarro, SBSeong, BKAGreifenberg, AKDust, SKwiatkowski, NPMarto, JAStegmaier, KZhang, TGeyer, MGray, NS Structure-activity relationship study of THZ531 derivatives enables the discovery of BSJ-01-175 as a dual CDK12/13 covalent inhibitor with efficacy in Ewing sarcoma. Eur J Med Chem 221:0 (2021)  
Target
Name:
Cyclin-dependent kinase 13/Cyclin-K
Synonyms:
Cyclin-K/Cyclin-dependent kinase 13
Type:
Mol. Mass.:
Description:
ASSAY_ID of ChEMBL is 2192353
Components:
This complex has 2 components.
Component 1
Name:
Cyclin-dependent kinase 13
Synonyms:
CDC2-related protein kinase 5 CDC2L5 CDK13_HUMAN Cell division cycle 2-like protein kinase 5 Cholinesterase-related cell division controller hCDK13
Type:
PROTEIN
Mol. Mass.:
165002.38
Organism:
Homo sapiens (Human)
Description:
ChEMBL_774241
Residue:
1512
  
Component 2
Name:
Cyclin-K
Synonyms:
CCNK CPR4
Type:
PROTEIN
Mol. Mass.:
64254.10
Organism:
Homo sapiens (Human)
Description:
ChEMBL_107901
Residue:
580
  
Inhibitor
Name:
BDBM50528813
Synonyms:
CHEMBL4163879
Type:
Small organic molecule
Emp. Form.:
C30H32ClN7O2
Mol. Mass.:
558.074
SMILES:
CN(C)C\C=C\C(=O)Nc1ccc(cc1)C(=O)N1CCC[C@H](C1)Nc1ncc(Cl)c(n1)-c1c[nH]c2ccccc12
: