Target
Probable G-protein coupled receptor 27
Ligand
BDBM50574003
Substrate
Meas. Tech.
ChEMBL_2121597 (CHEMBL4830744)
EC50
<100000±n/a nM
Citation
 Pillaiyar, TRosato, FWozniak, MBlavier, JCharles, MLaschet, CKronenberger, TMüller, CEHanson, J Structure-activity relationships of agonists for the orphan G protein-coupled receptor GPR27. Eur J Med Chem 225:0 (2021)  
Target
Name:
Probable G-protein coupled receptor 27
Synonyms:
GPR27 Probable G-protein coupled receptor 27 Super conserved receptor expressed in brain 1
Type:
PROTEIN
Mol. Mass.:
39835.29
Organism:
Homo sapiens
Description:
ChEMBL_119640
Residue:
375
  
Inhibitor
Name:
BDBM50574003
Synonyms:
CHEMBL4860134
Type:
Small organic molecule
Emp. Form.:
C18H14Cl2N2O4S2
Mol. Mass.:
457.351
SMILES:
Clc1ccc(c(Cl)c1)S(=O)(=O)Nc1ccc(cc1)S(=O)(=O)Nc1ccccc1
: