Target
Aurora kinase B/Inner centromere protein
Ligand
BDBM50574274
Substrate
Meas. Tech.
ChEMBL_2122113 (CHEMBL4831260)
IC50
56±n/a nM
Citation
 DeSelm, LHuck, BLan, RNeagu, CPotnick, JXiao, YChen, XJones, RRichardson, TEHeasley, BHHaxell, TMoore, JTian, HGeorgi, KRohdich, FSutton, AJohnson, TMochalkin, IJackson, JLin, JCrowley, LMachl, AClark, AWilker, ESherer, BGoutopoulos, A Identification of Clinical Candidate M2698, a Dual p70S6K and Akt Inhibitor, for Treatment of PAM Pathway-Altered Cancers. J Med Chem 64:14603-14619 (2021)  
Target
Name:
Aurora kinase B/Inner centromere protein
Synonyms:
Aurora B/Incenp
Type:
Protein Complex
Mol. Mass.:
Description:
Components:
This complex has 2 components.
Component 1
Name:
Aurora kinase B
Synonyms:
AIK2 AIM1 ARK2 AURKB_HUMAN Aurora B-INCENP Aurora kinase B (AURKB) STK-1 STK12 Serine/threonine-protein kinase aurora B
Type:
Protein
Mol. Mass.:
39327.72
Organism:
Homo sapiens (Human)
Description:
Q96GD4
Residue:
344
  
Component 2
Name:
Inner centromere protein
Synonyms:
INCENP | INCE_HUMAN
Type:
Protein
Mol. Mass.:
105461.33
Organism:
Homo sapiens (Human)
Description:
Q9NQS7
Residue:
918
  
Inhibitor
Name:
BDBM50574274
Synonyms:
CHEMBL4860970
Type:
Small organic molecule
Emp. Form.:
C20H19F2N5O
Mol. Mass.:
383.3946
SMILES:
NC(=O)c1cccc2c(N[C@H](CN3CCC3)c3ccc(F)c(F)c3)ncnc12
: