Target
Prostaglandin G/H synthase 2
Ligand
BDBM50140316
Substrate
Meas. Tech.
ChEMBL_159926 (CHEMBL769652)
IC50
2000±n/a nM
Citation
 Riendeau, DSalem, MStyhler, AOuellet, MMancini, JALi, CS Evaluation of loxoprofen and its alcohol metabolites for potency and selectivity of inhibition of cyclooxygenase-2. Bioorg Med Chem Lett 14:1201-3 (2004)  
Target
Name:
Prostaglandin G/H synthase 2
Synonyms:
COX2 Cyclooxygenase 2 (COX-2) Cyclooxygenase-2 (COX-2 AA) Cyclooxygenase-2 (COX-2) PGH2_HUMAN PHS II Prostaglandin E synthase/G/H synthase 2 Prostaglandin-endoperoxide synthase 2
Type:
Enzyme
Mol. Mass.:
69003.89
Organism:
Homo sapiens (Human)
Description:
Recombinant Cox-2 provided by Cayman (Cayman Chemical Co.,Ann Arbor, MI).
Residue:
604
  
Inhibitor
Name:
BDBM50140316
Synonyms:
(S)-2-[4-((1S,2R)-2-Hydroxy-cyclopentylmethyl)-phenyl]-propionic acid | CHEMBL19286
Type:
Small organic molecule
Emp. Form.:
C15H20O3
Mol. Mass.:
248.3175
SMILES:
C[C@H](C(O)=O)c1ccc(C[C@@H]2CCC[C@H]2O)cc1
: