Target
Prostaglandin G/H synthase 1
Ligand
BDBM50140319
Substrate
Meas. Tech.
ChEMBL_158919 (CHEMBL763483)
IC50
>25000±n/a nM
Citation
 Riendeau, DSalem, MStyhler, AOuellet, MMancini, JALi, CS Evaluation of loxoprofen and its alcohol metabolites for potency and selectivity of inhibition of cyclooxygenase-2. Bioorg Med Chem Lett 14:1201-3 (2004)  
Target
Name:
Prostaglandin G/H synthase 1
Synonyms:
COX-1 Cyclooxygenase Cyclooxygenase-1 (COX-1) PTGS1 | Prostaglandin G/H synthase (cyclooxygenase)
Type:
Enzyme
Mol. Mass.:
68692.62
Organism:
Homo sapiens (Human)
Description:
P23219
Residue:
599
  
Inhibitor
Name:
BDBM50140319
Synonyms:
2-[4-(2-Hydroxy-cyclopentylmethyl)-phenyl]-propionic acid | CHEMBL416542
Type:
Small organic molecule
Emp. Form.:
C15H20O3
Mol. Mass.:
248.3175
SMILES:
CC(C(O)=O)c1ccc(CC2CCCC2O)cc1
: