Target
Reverse transcriptase/RNaseH
Ligand
BDBM50103642
Substrate
Meas. Tech.
ChEMBL_2123991 (CHEMBL4833224)
IC50
11±n/a nM
Citation
 Huang, BGinex, TLuque, FJJiang, XGao, PZhang, JKang, DDaelemans, DDe Clercq, EPannecouque, CZhan, PLiu, X Structure-Based Design and Discovery of Pyridyl-Bearing Fused Bicyclic HIV-1 Inhibitors: Synthesis, Biological Characterization, and Molecular Modeling Studies. J Med Chem 64:13604-13621 (2021)  
Target
Name:
Reverse transcriptase/RNaseH
Synonyms:
HIV-1 Reverse Transcriptase RNase H Reverse transcriptase/RNaseH
Type:
PROTEIN
Mol. Mass.:
65229.15
Organism:
Human immunodeficiency virus 1
Description:
ChEMBL_1473730
Residue:
566
  
Inhibitor
Name:
BDBM50103642
Synonyms:
4-(6-amino-5-bromo-2-(4-cyanophenylamino)pyrimidin-4-ylamino)-3,5-dimethylbenzonitrile 4-({6-AMINO-5-BROMO-2-[(4-CYANOPHENYL)AMINO]PYRIMIDIN-4-YL}OXY)-3,5-DIMETHYLBENZONITRILE CHEMBL308954 Etravirine (ETR) Etravirine (TMC125) TMC-125
Type:
Small organic molecule
Emp. Form.:
C20H15BrN6O
Mol. Mass.:
435.277
SMILES:
Cc1cc(cc(C)c1Oc1nc(Nc2ccc(cc2)C#N)nc(N)c1Br)C#N
: