Target
Dual specificity mitogen-activated protein kinase kinase 4
Ligand
BDBM50577647
Substrate
Meas. Tech.
ChEMBL_2130725 (CHEMBL4840154)
IC50
310±n/a nM
Citation
 Kwong, AJPham, TNDOelschlager, HEMunshi, HGScheidt, KA Rational Design, Optimization, and Biological Evaluation of Novel MEK4 Inhibitors against Pancreatic Adenocarcinoma. ACS Med Chem Lett 12:1559-1567 (2021)  
Target
Name:
Dual specificity mitogen-activated protein kinase kinase 4
Synonyms:
JNK-activating kinase 1 JNKK1 MAP2K4 MKK4 PRKMK4 SEK1 SKK1 | c-Jun N-terminal kinase kinase 1
Type:
PROTEIN
Mol. Mass.:
44294.29
Organism:
Homo sapiens (Human)
Description:
ChEMBL_1460558
Residue:
399
  
Inhibitor
Name:
BDBM50577647
Synonyms:
CHEMBL4849172
Type:
Small organic molecule
Emp. Form.:
C13H9FN2
Mol. Mass.:
212.2224
SMILES:
Fc1ccc2c(n[nH]c2c1)-c1ccccc1
: