Target
Cholesteryl ester transfer protein
Ligand
BDBM50348228
Substrate
Meas. Tech.
ChEMBL_2134010 (CHEMBL4843620)
IC50
17±n/a nM
Citation
 Vachal, PDuffy, JLCampeau, LCAmin, RPMitra, KMurphy, BAShao, PPSinclair, PJYe, FKatipally, RLu, ZOndeyka, DChen, YHZhao, KSun, WTyagarajan, SBao, JWang, SPCote, JLipardi, CMetzger, DLeung, DHartmann, GWollenberg, GKLiu, JTan, LXu, YChen, QLiu, GBlaustein, ROJohns, DG Invention of MK-8262, a Cholesteryl Ester Transfer Protein (CETP) Inhibitor Backup to Anacetrapib with Best-in-Class Properties. J Med Chem 64:13215-13258 (2021)  
Target
Name:
Cholesteryl ester transfer protein
Synonyms:
CETP Cholesteryl ester transfer protein (CETP) | Lipid transfer protein I
Type:
Enzyme
Mol. Mass.:
54751.53
Organism:
Homo sapiens (Human)
Description:
P11597
Residue:
493
  
Inhibitor
Name:
BDBM50348228
Synonyms:
CHEMBL1800807
Type:
Small organic molecule
Emp. Form.:
C30H25F10NO3
Mol. Mass.:
637.5084
SMILES:
COc1cc(F)c(cc1-c1ccc(cc1CN1[C@@H](C)[C@H](OC1=O)c1cc(cc(c1)C(F)(F)F)C(F)(F)F)C(F)(F)F)C(C)C
: