Target
Plasma kallikrein
Ligand
BDBM416926
Substrate
Meas. Tech.
ChEMBL_2134840 (CHEMBL4844450)
IC50
14±n/a nM
Citation
 Kotian, PLWu, MVadlakonda, SChintareddy, VLu, PJuarez, LKellogg-Yelder, DChen, XMuppa, SChambers-Wilson, RDavis Parker, CWilliams, JPolach, KJZhang, WRaman, KBabu, YS Berotralstat (BCX7353): Structure-Guided Design of a Potent, Selective, and Oral Plasma Kallikrein Inhibitor to Prevent Attacks of Hereditary Angioedema (HAE). J Med Chem 64:12453-12468 (2021)  
Target
Name:
Plasma kallikrein
Synonyms:
Fletcher factor KLKB1 Kallikrein Plasma kallikrein heavy chain Plasma prekallikrein
Type:
Protein
Mol. Mass.:
71391.16
Organism:
Homo sapiens (Human)
Description:
P03952
Residue:
638
  
Inhibitor
Name:
BDBM416926
Synonyms:
(+)-1-(3-(aminomethyl)phenyl)-N-(5-((3-cyanophenyl)(cyclopropyl-methylamino)methyl)-2-fluorophenyl)-3-(trifluoromethyl)-1H-pyrazole-5-carboxamide | US10329260, Compound 70a
Type:
Small organic molecule
Emp. Form.:
C30H26F4N6O
Mol. Mass.:
562.5607
SMILES:
NCc1cccc(c1)-n1nc(cc1C(=O)Nc1cc(ccc1F)C(NCC1CC1)c1cccc(c1)C#N)C(F)(F)F
: