Target
Tissue-type plasminogen activator
Ligand
BDBM416926
Substrate
Meas. Tech.
ChEMBL_2134852 (CHEMBL4844462)
IC50
>50000±n/a nM
Citation
 Kotian, PLWu, MVadlakonda, SChintareddy, VLu, PJuarez, LKellogg-Yelder, DChen, XMuppa, SChambers-Wilson, RDavis Parker, CWilliams, JPolach, KJZhang, WRaman, KBabu, YS Berotralstat (BCX7353): Structure-Guided Design of a Potent, Selective, and Oral Plasma Kallikrein Inhibitor to Prevent Attacks of Hereditary Angioedema (HAE). J Med Chem 64:12453-12468 (2021)  
Target
Name:
Tissue-type plasminogen activator
Synonyms:
Alteplase Reteplase Thrombin receptor protein Tissue-type plasminogen activator (tPA) t-PA t-plasminogen activator
Type:
Enzyme
Mol. Mass.:
62931.08
Organism:
Homo sapiens (Human)
Description:
Residue:
562
  
Inhibitor
Name:
BDBM416926
Synonyms:
(+)-1-(3-(aminomethyl)phenyl)-N-(5-((3-cyanophenyl)(cyclopropyl-methylamino)methyl)-2-fluorophenyl)-3-(trifluoromethyl)-1H-pyrazole-5-carboxamide | US10329260, Compound 70a
Type:
Small organic molecule
Emp. Form.:
C30H26F4N6O
Mol. Mass.:
562.5607
SMILES:
NCc1cccc(c1)-n1nc(cc1C(=O)Nc1cc(ccc1F)C(NCC1CC1)c1cccc(c1)C#N)C(F)(F)F
: