Target
Plasma kallikrein
Ligand
BDBM50579244
Substrate
Meas. Tech.
ChEMBL_2134889 (CHEMBL4844499)
Ki
0.260000±n/a nM
Citation
 Kotian, PLWu, MVadlakonda, SChintareddy, VLu, PJuarez, LKellogg-Yelder, DChen, XMuppa, SChambers-Wilson, RDavis Parker, CWilliams, JPolach, KJZhang, WRaman, KBabu, YS Berotralstat (BCX7353): Structure-Guided Design of a Potent, Selective, and Oral Plasma Kallikrein Inhibitor to Prevent Attacks of Hereditary Angioedema (HAE). J Med Chem 64:12453-12468 (2021)  
Target
Name:
Plasma kallikrein
Synonyms:
Fletcher factor KLKB1 Kallikrein Plasma kallikrein heavy chain Plasma prekallikrein
Type:
Protein
Mol. Mass.:
71391.16
Organism:
Homo sapiens (Human)
Description:
P03952
Residue:
638
  
Inhibitor
Name:
BDBM50579244
Synonyms:
Avoralstat | BCX-4161
Type:
Small organic molecule
Emp. Form.:
C28H27N5O5
Mol. Mass.:
513.5445
SMILES:
COc1cc(c(cc1C=C)C(=O)Nc1ccc(cc1)C(N)=N)-c1ccc(nc1C(O)=O)C(=O)NCC1CC1
: