Target
Endothelin-1 receptor
Ligand
BDBM50146651
Substrate
Meas. Tech.
ChEMBL_65482 (CHEMBL682357)
IC50
3.9±n/a nM
Citation
 Bolli, MHMarfurt, JGrisostomi, CBoss, CBinkert, CHess, PTreiber, AThorin, EMorrison, KBuchmann, SBur, DRamuz, HClozel, MFischli, WWeller, T Novel benzo[1,4]diazepin-2-one derivatives as endothelin receptor antagonists. J Med Chem 47:2776-95 (2004)  
Target
Name:
Endothelin-1 receptor
Synonyms:
EDNRA ET-A ETA-R Endothelin receptor type A hET-AR
Type:
Enzyme Catalytic Domain
Mol. Mass.:
48736.88
Organism:
Homo sapiens (Human)
Description:
P25101
Residue:
427
  
Inhibitor
Name:
BDBM50146651
Synonyms:
(S)-(4,6-Dimethyl-pyrimidin-2-yloxy)-((S)-2-oxo-1-phenethyl-5-phenyl-2,3,4,5-tetrahydro-1H-benzo[e][1,4]diazepin-5-yl)-acetic acid | CHEMBL96171
Type:
Small organic molecule
Emp. Form.:
C31H30N4O4
Mol. Mass.:
522.5943
SMILES:
Cc1cc(C)nc(O[C@H](C(O)=O)[C@]2(NCC(=O)N(CCc3ccccc3)c3ccccc23)c2ccccc2)n1
: