Target
Endothelin-1 receptor
Ligand
BDBM50146661
Substrate
Meas. Tech.
ChEMBL_65482 (CHEMBL682357)
IC50
7.4±n/a nM
Citation
 Bolli, MHMarfurt, JGrisostomi, CBoss, CBinkert, CHess, PTreiber, AThorin, EMorrison, KBuchmann, SBur, DRamuz, HClozel, MFischli, WWeller, T Novel benzo[1,4]diazepin-2-one derivatives as endothelin receptor antagonists. J Med Chem 47:2776-95 (2004)  
Target
Name:
Endothelin-1 receptor
Synonyms:
EDNRA ET-A ETA-R Endothelin receptor type A hET-AR
Type:
Enzyme Catalytic Domain
Mol. Mass.:
48736.88
Organism:
Homo sapiens (Human)
Description:
P25101
Residue:
427
  
Inhibitor
Name:
BDBM50146661
Synonyms:
4-{(S)-5-[(S)-Carboxy-(4,6-dimethyl-pyrimidin-2-yloxy)-methyl]-2-oxo-5-phenyl-2,3,4,5-tetrahydro-benzo[e][1,4]diazepin-1-ylmethyl}-benzoic acid methyl ester | CHEMBL316301
Type:
Small organic molecule
Emp. Form.:
C32H30N4O6
Mol. Mass.:
566.6038
SMILES:
COC(=O)c1ccc(CN2c3ccccc3[C@](NCC2=O)([C@H](Oc2nc(C)cc(C)n2)C(O)=O)c2ccccc2)cc1
: