Target
Endothelin receptor type B
Ligand
BDBM50146730
Substrate
Meas. Tech.
ChEMBL_63683 (CHEMBL670641)
IC50
32.2±n/a nM
Citation
 Bolli, MHMarfurt, JGrisostomi, CBoss, CBinkert, CHess, PTreiber, AThorin, EMorrison, KBuchmann, SBur, DRamuz, HClozel, MFischli, WWeller, T Novel benzo[1,4]diazepin-2-one derivatives as endothelin receptor antagonists. J Med Chem 47:2776-95 (2004)  
Target
Name:
Endothelin receptor type B
Synonyms:
EDNRB ENDOTHELIN B ETRB Endothelin receptor non-selective type | Endothelin receptor, ET-A/ET-B
Type:
Enzyme Catalytic Domain
Mol. Mass.:
49664.00
Organism:
Homo sapiens (Human)
Description:
ENDOTHELIN B EDNRB HUMAN::P24530
Residue:
442
  
Inhibitor
Name:
BDBM50146730
Synonyms:
(S)-(4,6-Dimethyl-pyrimidin-2-yloxy)-[(S)-2-oxo-5-phenyl-1-(4-trifluoromethoxy-benzyl)-2,3,4,5-tetrahydro-1H-benzo[e][1,4]diazepin-5-yl]-acetic acid | CHEMBL91873
Type:
Small organic molecule
Emp. Form.:
C31H27F3N4O5
Mol. Mass.:
592.5651
SMILES:
Cc1cc(C)nc(O[C@H](C(O)=O)[C@]2(NCC(=O)N(Cc3ccc(OC(F)(F)F)cc3)c3ccccc23)c2ccccc2)n1
: