Target
Endothelin-1 receptor
Ligand
BDBM50146675
Substrate
Meas. Tech.
ChEMBL_65482 (CHEMBL682357)
IC50
7.9±n/a nM
Citation
 Bolli, MHMarfurt, JGrisostomi, CBoss, CBinkert, CHess, PTreiber, AThorin, EMorrison, KBuchmann, SBur, DRamuz, HClozel, MFischli, WWeller, T Novel benzo[1,4]diazepin-2-one derivatives as endothelin receptor antagonists. J Med Chem 47:2776-95 (2004)  
Target
Name:
Endothelin-1 receptor
Synonyms:
EDNRA ET-A ETA-R Endothelin receptor type A hET-AR
Type:
Enzyme Catalytic Domain
Mol. Mass.:
48736.88
Organism:
Homo sapiens (Human)
Description:
P25101
Residue:
427
  
Inhibitor
Name:
BDBM50146675
Synonyms:
(S)-[(S)-5-(3-Butyl-phenyl)-1-(4-methoxy-benzyl)-2-oxo-2,3,4,5-tetrahydro-1H-benzo[e][1,4]diazepin-5-yl]-(4,6-dimethyl-pyrimidin-2-yloxy)-acetic acid | CHEMBL422068
Type:
Small organic molecule
Emp. Form.:
C35H38N4O5
Mol. Mass.:
594.7
SMILES:
CCCCc1cccc(c1)[C@@]1(NCC(=O)N(Cc2ccc(OC)cc2)c2ccccc12)[C@H](Oc1nc(C)cc(C)n1)C(O)=O
: