Target
Cyclin-dependent kinase 8
Ligand
BDBM50579915
Substrate
Meas. Tech.
ChEMBL_2145811 (CHEMBL5030091)
IC50
4.5±n/a nM
Citation
 Saito, KShinozuka, TNakao, AKunikata, TNakai, DNagai, YNaito, S Discovery of 3-amino-4-{(3S)-3-[(2-ethoxyethoxy)methyl]piperidin-1-yl}thieno[2,3-b]pyridine-2-carboxamide (DS96432529): A potent and orally active bone anabolic agent. Bioorg Med Chem Lett 54:0 (2021)  
Target
Name:
Cyclin-dependent kinase 8
Synonyms:
CDK8 Cell division protein kinase 8 Mediator complex subunit CDK8 Protein kinase K35
Type:
Serine/threonine-protein kinase
Mol. Mass.:
53300.21
Organism:
Homo sapiens (Human)
Description:
P49336
Residue:
464
  
Inhibitor
Name:
BDBM50579915
Synonyms:
CHEMBL4442570
Type:
Small organic molecule
Emp. Form.:
C21H23FN4O3S
Mol. Mass.:
430.496
SMILES:
CN(C)C(=O)CCCc1ccc(Oc2cc(C)nc3sc(C(N)=O)c(N)c23)c(F)c1
: