Target
Beta-3 adrenergic receptor
Ligand
BDBM50106820
Substrate
Meas. Tech.
ChEBML_39051
Ki
81±n/a nM
Target
Name:
Beta-3 adrenergic receptor
Synonyms:
ADRB3 ADRB3_HUMAN Beta-2 adrenergic receptor and beta-3 adrenergic receptor Beta-3 adrenoreceptor | adrenergic Beta3
Type:
G Protein-Coupled Receptor (GPCR)
Mol. Mass.:
43534.88
Organism:
Homo sapiens (Human)
Description:
Residue:
408
  
Inhibitor
Name:
BDBM50106820
Synonyms:
(R)-N-(5-(2-(bis(4-methoxyphenyl)methylamino)-1-hydroxyethyl)-2-hydroxyphenyl)methanesulfonamide N-[(R)-5-(2-{[Bis-(4-methoxy-phenyl)-methyl]-amino}-1-hydroxy-ethyl)-2-hydroxy-phenyl]-methanesulfonamide | N-[5-((R)-2-{[Bis-(4-methoxy-phenyl)-methyl]-amino}-1-hydroxy-ethyl)-2-hydroxy-phenyl]-methanesulfonamide
Type:
Small organic molecule
Emp. Form.:
C24H28N2O6S
Mol. Mass.:
472.554
SMILES:
COc1ccc(cc1)C(NC[C@H](O)c1ccc(O)c(NS(C)(=O)=O)c1)c1ccc(OC)cc1
: