Target
Beta-3 adrenergic receptor
Ligand
BDBM50148510
Substrate
Meas. Tech.
ChEBML_39051
Ki
46±n/a nM
Target
Name:
Beta-3 adrenergic receptor
Synonyms:
ADRB3 ADRB3_HUMAN Beta-2 adrenergic receptor and beta-3 adrenergic receptor Beta-3 adrenoreceptor | adrenergic Beta3
Type:
G Protein-Coupled Receptor (GPCR)
Mol. Mass.:
43534.88
Organism:
Homo sapiens (Human)
Description:
Residue:
408
  
Inhibitor
Name:
BDBM50148510
Synonyms:
(S)-N-(3,4-Dimethoxy-phenyl)-2-[2-hydroxy-2-((R)-4-hydroxy-3-methanesulfonylamino-phenyl)-ethylamino]-2-(4-methoxy-phenyl)-propionamide | CHEMBL332632
Type:
Small organic molecule
Emp. Form.:
C27H33N3O8S
Mol. Mass.:
559.631
SMILES:
COc1ccc(cc1)[C@](C)(NC[C@H](O)c1ccc(O)c(NS(C)(=O)=O)c1)C(=O)Nc1ccc(OC)c(OC)c1
: