Target
Nuclear receptor subfamily 2 group E member 1
Ligand
BDBM50580569
Substrate
Meas. Tech.
ChEMBL_2148634 (CHEMBL5033032)
EC50
52000±n/a nM
Citation
 Faudone, GBischoff-Kont, IRachor, LWillems, SZhubi, RKaiser, AChaikuad, AKnapp, SFürst, RHeering, JMerk, D Propranolol Activates the Orphan Nuclear Receptor TLX to Counteract Proliferation and Migration of Glioblastoma Cells. J Med Chem 64:8727-8738 (2021)  
Target
Name:
Nuclear receptor subfamily 2 group E member 1
Synonyms:
NR2E1 Nuclear receptor TLX TLX hTll
Type:
PROTEIN
Mol. Mass.:
42606.25
Organism:
Homo sapiens
Description:
ChEMBL_104473
Residue:
385
  
Inhibitor
Name:
BDBM50580569
Synonyms:
CHEMBL5083628
Type:
Small organic molecule
Emp. Form.:
C17H23NO2
Mol. Mass.:
273.37
SMILES:
COC(CNC(C)C)COc1cccc2ccccc12
: