Target
Nuclear receptor subfamily 2 group E member 1
Ligand
BDBM25761
Substrate
Meas. Tech.
ChEMBL_2148637 (CHEMBL5033035)
EC50
32000±n/a nM
Citation
 Faudone, GBischoff-Kont, IRachor, LWillems, SZhubi, RKaiser, AChaikuad, AKnapp, SFürst, RHeering, JMerk, D Propranolol Activates the Orphan Nuclear Receptor TLX to Counteract Proliferation and Migration of Glioblastoma Cells. J Med Chem 64:8727-8738 (2021)  
Target
Name:
Nuclear receptor subfamily 2 group E member 1
Synonyms:
NR2E1 Nuclear receptor TLX TLX hTll
Type:
PROTEIN
Mol. Mass.:
42606.25
Organism:
Homo sapiens
Description:
ChEMBL_104473
Residue:
385
  
Inhibitor
Name:
BDBM25761
Synonyms:
Anapriline CHEMBL27 PROPRANOLOL, d PROPRANOLOL,(+) Propanolol Propranolol | [2-hydroxy-3-(naphthalen-1-yloxy)propyl](propan-2-yl)amine
Type:
Small organic molecule
Emp. Form.:
C16H21NO2
Mol. Mass.:
259.3434
SMILES:
CC(C)NCC(O)COc1cccc2ccccc12
: