Target
Nuclear receptor subfamily 2 group E member 1
Ligand
BDBM50580566
Substrate
Meas. Tech.
ChEMBL_2148639 (CHEMBL5033037)
EC50
>100000±n/a nM
Citation
 Faudone, GBischoff-Kont, IRachor, LWillems, SZhubi, RKaiser, AChaikuad, AKnapp, SFürst, RHeering, JMerk, D Propranolol Activates the Orphan Nuclear Receptor TLX to Counteract Proliferation and Migration of Glioblastoma Cells. J Med Chem 64:8727-8738 (2021)  
Target
Name:
Nuclear receptor subfamily 2 group E member 1
Synonyms:
NR2E1 Nuclear receptor TLX TLX hTll
Type:
PROTEIN
Mol. Mass.:
42606.25
Organism:
Homo sapiens
Description:
ChEMBL_104473
Residue:
385
  
Inhibitor
Name:
BDBM50580566
Synonyms:
CHEMBL3304960
Type:
Small organic molecule
Emp. Form.:
C12H14N2
Mol. Mass.:
186.253
SMILES:
NC1CCc2[nH]c3ccccc3c2C1
: