Target
Cell division protein FtsZ
Ligand
BDBM50079356
Substrate
Meas. Tech.
ChEMBL_2149630 (CHEMBL5034092)
Kd
<100±n/a nM
Citation
 Huecas, SAraújo-Bazán, LRuiz, FMRuiz-Ávila, LBMartínez, RFEscobar-Peńa, AArtola, MVázquez-Villa, HMartín-Fontecha, MFernández-Tornero, CLópez-Rodríguez, MLAndreu, JM Targeting the FtsZ Allosteric Binding Site with a Novel Fluorescence Polarization Screen, Cytological and Structural Approaches for Antibacterial Discovery. J Med Chem 64:5730-5745 (2021)  
Target
Name:
Cell division protein FtsZ
Synonyms:
Type:
PROTEIN
Mol. Mass.:
40375.29
Organism:
Bacillus subtilis
Description:
ChEMBL_107642
Residue:
382
  
Inhibitor
Name:
BDBM50079356
Synonyms:
CHEMBL511201
Type:
Small organic molecule
Emp. Form.:
C14H8ClF2N3O2S
Mol. Mass.:
355.747
SMILES:
NC(=O)c1c(F)ccc(OCc2nc3cc(Cl)cnc3s2)c1F
: