Target
Solute carrier organic anion transporter family member 1B1
Ligand
BDBM50581535
Substrate
Meas. Tech.
ChEMBL_2151352 (CHEMBL5035814)
EC50
130±n/a nM
Citation
 Tucker, TJEmbrey, MWAlleyne, CAmin, RPBass, ABhatt, BBianchi, EBranca, DBueters, TBuist, NHa, SNHafey, MHe, HHiggins, JJohns, DGKerekes, ADKoeplinger, KAKuethe, JTLi, NMurphy, BOrth, PSalowe, SShahripour, ATracy, RWang, WWu, CXiong, YZokian, HJWood, HBWalji, A A Series of Novel, Highly Potent, and Orally Bioavailable Next-Generation Tricyclic Peptide PCSK9 Inhibitors. J Med Chem 64:16770-16800 (2021)  
Target
Name:
Solute carrier organic anion transporter family member 1B1
Synonyms:
LST1 OATP2 SLC21A6 SO1B1_HUMAN Solute carrier organic anion transporter family member 1B1 (OATP1B1) | Thromboxane B2
Type:
Protein
Mol. Mass.:
76468.06
Organism:
Homo sapiens (Human)
Description:
Q9Y6L6
Residue:
691
  
Inhibitor
Name:
BDBM50581535
Synonyms:
CHEMBL5091040
Type:
Small organic molecule
Emp. Form.:
C69H85FN10O12S2
Mol. Mass.:
1329.601
SMILES:
CO[C@H](C)[C@@H]1NC(=O)[C@@H]2[C@@H]3CCN2C(=O)[C@H](Cc2c[nH]c4ccc(F)cc24)NC(=O)[C@H](Cc2cccc(C\C=C\CO3)c2)NC(=O)[C@@H](C)NC(=O)[C@H](C)NC(=O)CCSCc2cccc(CSCCNC(=O)[C@]3(C)CCCN3C(=O)[C@H](Cc3ccc(OC)cc3)NC1=O)c2
: