Target
Solute carrier organic anion transporter family member 1B1
Ligand
BDBM50581544
Substrate
Meas. Tech.
ChEMBL_2151352 (CHEMBL5035814)
EC50
600±n/a nM
Citation
 Tucker, TJEmbrey, MWAlleyne, CAmin, RPBass, ABhatt, BBianchi, EBranca, DBueters, TBuist, NHa, SNHafey, MHe, HHiggins, JJohns, DGKerekes, ADKoeplinger, KAKuethe, JTLi, NMurphy, BOrth, PSalowe, SShahripour, ATracy, RWang, WWu, CXiong, YZokian, HJWood, HBWalji, A A Series of Novel, Highly Potent, and Orally Bioavailable Next-Generation Tricyclic Peptide PCSK9 Inhibitors. J Med Chem 64:16770-16800 (2021)  
Target
Name:
Solute carrier organic anion transporter family member 1B1
Synonyms:
LST1 OATP2 SLC21A6 SO1B1_HUMAN Solute carrier organic anion transporter family member 1B1 (OATP1B1) | Thromboxane B2
Type:
Protein
Mol. Mass.:
76468.06
Organism:
Homo sapiens (Human)
Description:
Q9Y6L6
Residue:
691
  
Inhibitor
Name:
BDBM50581544
Synonyms:
CHEMBL5086475
Type:
Small organic molecule
Emp. Form.:
C71H85FN14O12S2
Mol. Mass.:
1409.65
SMILES:
COc1ccc(C[C@@H]2NC(=O)[C@@H](NC(=O)[C@@H]3[C@@H]4CCN3C(=O)[C@@H]3Cc5cn(Cc6cn(nn6)-c6cc(CSCCNC(=O)[C@]7(C)CCCN7C2=O)cc(CSCCC(=O)N[C@@H](CN)C(=O)N[C@H](C)C(=O)N[C@@H](Cc2cccc(C\C=C\CO4)c2)C(=O)N3)c6)c2ccc(F)cc52)[C@@H](C)O)cc1
: