Target
S-adenosylmethionine synthase isoform type-2
Ligand
BDBM50581709
Substrate
Meas. Tech.
ChEMBL_2152068 (CHEMBL5036615)
IC50
16±n/a nM
Citation
 De Fusco, CSchimpl, MBörjesson, UCheung, TCollie, IEvans, LNarasimhan, PStubbs, CVazquez-Chantada, MWagner, DJGrondine, MSanders, MGTentarelli, SUnderwood, EArgyrou, ASmith, JMLynch, JTChiarparin, ERobb, GBagal, SKScott, JS Fragment-Based Design of a Potent MAT2a Inhibitor and  J Med Chem 64:6814-6826 (2021)  
Target
Name:
S-adenosylmethionine synthase isoform type-2
Synonyms:
AMS2 MAT 2 MAT2A METK2_HUMAN Methionine adenosyltransferase II
Type:
Protein
Mol. Mass.:
43659.65
Organism:
Human
Description:
P31153
Residue:
395
  
Inhibitor
Name:
BDBM50581709
Synonyms:
CHEMBL5075691
Type:
Small organic molecule
Emp. Form.:
C17H16ClN3O
Mol. Mass.:
313.781
SMILES:
CN(C)c1nc(=O)n(-c2cccc(C)c2)c2cc(Cl)ccc12
: