Target
Cytochrome P450 3A5
Ligand
BDBM50584760
Substrate
Meas. Tech.
ChEMBL_2160650 (CHEMBL5045400)
IC50
2340±n/a nM
Citation
 Tu, DNing, JZou, LWang, PZhang, YTian, XZhang, FZheng, JGe, G Unique Oxidative Metabolism of Bufalin Generates Two Reactive Metabolites That Strongly Inactivate Human Cytochrome P450 3A. J Med Chem 65:4018-4029 (2022)  
Target
Name:
Cytochrome P450 3A5
Synonyms:
CP3A5_HUMAN Cytochrome P450 3A5 | Cytochrome P450 3A5 (CYP3A5)
Type:
Protein
Mol. Mass.:
57118.00
Organism:
Homo sapiens (Human)
Description:
P20815
Residue:
502
  
Inhibitor
Name:
BDBM50584760
Synonyms:
CHEMBL2068968
Type:
Small organic molecule
Emp. Form.:
C24H32O4
Mol. Mass.:
384.5085
SMILES:
[H][C@]12CC[C@]3([H])[C@]([H])(CC[C@]4(C)[C@H](CC[C@]34O)c3ccc(=O)oc3)[C@@]1(C)CCC(=O)C2
: