Target
Histone deacetylase 2
Ligand
BDBM50585745
Substrate
Meas. Tech.
ChEMBL_2163759 (CHEMBL5048620)
IC50
105000±n/a nM
Citation
 Belayet, JBBeamish, SRahaman, MAlanani, SVirdi, RSFrick, DNRahman, AFMTUlicki, JSBiswas, SArnold, LARoni, MSRCheng, EYSteeber, DAFrick, KMHossain, MM Development of a Novel, Small-Molecule Brain-Penetrant Histone Deacetylase Inhibitor That Enhances Spatial Memory Formation in Mice. J Med Chem 65:3388-3403 (2022)  
Target
Name:
Histone deacetylase 2
Synonyms:
Cereblon/Histone deacetylase 2 HDAC2 Histone deacetylase 2 (HDAC2) | Human HDAC2
Type:
Chromatin regulator; hydrolase; repressor
Mol. Mass.:
55356.54
Organism:
Homo sapiens (Human)
Description:
Q92769
Residue:
488
  
Inhibitor
Name:
BDBM50585745
Synonyms:
CHEMBL5084611
Type:
Small organic molecule
Emp. Form.:
C26H32N2O4S2
Mol. Mass.:
500.673
SMILES:
OC(CC(=O)Nc1ccccc1)\C=C\CCSSCC\C=C\C(O)CC(=O)Nc1ccccc1
: