Target
Protein cereblon
Ligand
BDBM50586180
Substrate
Meas. Tech.
ChEMBL_2165247 (CHEMBL5050108)
IC50
1.1±n/a nM
Citation
 Alcock, LJChang, YJarusiewicz, JAActis, MNithianantham, SMayasundari, AMin, JMaxwell, DHunt, JSmart, BYang, JJNishiguchi, GFischer, MMullighan, CGRankovic, Z Development of Potent and Selective Janus Kinase 2/3 Directing PG-PROTACs. ACS Med Chem Lett 13:475-482 (2022)  
Target
Name:
Protein cereblon
Synonyms:
CRBN | CRBN_HUMAN
Type:
PROTEIN
Mol. Mass.:
50537.73
Organism:
Homo sapiens (Human)
Description:
ChEMBL_116917
Residue:
442
  
Inhibitor
Name:
BDBM50586180
Synonyms:
CHEMBL5082689
Type:
Small organic molecule
Emp. Form.:
C38H41N11O5S
Mol. Mass.:
763.868
SMILES:
CCS(=O)(=O)N1CC(CC#N)(C1)n1cc(cn1)-c1nc(Nc2ccc(cc2)C(=O)NCCCCNc2cccc(c2)C2CCC(=O)NC2=O)nc2[nH]ccc12
: