Target
Melanocortin receptor 4
Ligand
BDBM50410195
Substrate
Meas. Tech.
ChEMBL_306725 (CHEMBL831488)
IC50
275±n/a nM
Citation
 Wilczynski, AWang, XSBauzo, RMXiang, ZShaw, AMMillard, WJRichards, NGEdison, ASHaskell-Luevano, C Structural characterization and pharmacology of a potent (Cys101-Cys119, Cys110-Cys117) bicyclic agouti-related protein (AGRP) melanocortin receptor antagonist. J Med Chem 47:5662-73 (2004)  
Target
Name:
Melanocortin receptor 4
Synonyms:
MC4-R Mc4r
Type:
PROTEIN
Mol. Mass.:
36964.43
Organism:
Mus musculus
Description:
ChEMBL_1498850
Residue:
332
  
Inhibitor
Name:
BDBM50410195
Synonyms:
CHEMBL2096710
Type:
Small organic molecule
Emp. Form.:
C64H79N15O13S2
Mol. Mass.:
1330.535
SMILES:
C[C@@H]1NC(=O)[C@H](CC(N)=O)NC(=O)[C@H](Cc2ccccc2)NC(=O)[C@H](Cc2ccccc2)NC(=O)[C@H](CCCNC(N)=N)NC(=O)[C@H](CSSC[C@H](NC(=O)[C@H](Cc2ccccc2)NC1=O)C(=O)N[C@@H](Cc1ccc(O)cc1)C(N)=O)NC(=O)[C@@H](N)Cc1ccc(O)cc1
: