Target
Bromodomain-containing protein 2
Ligand
BDBM296886
Substrate
Meas. Tech.
ChEMBL_2169252 (CHEMBL5054311)
IC50
1.7±n/a nM
Citation
 Gavai, AVNorris, DDelucca, GTortolani, DTokarski, JSDodd, DO'Malley, DZhao, YQuesnelle, CGill, PVaccaro, WHuynh, TAhuja, VHan, WCMussari, CHarikrishnan, LKamau, MPoss, MSheriff, SYan, CMarsilio, FMenard, KWen, MLRampulla, RWu, DRLi, JZhang, HLi, PSun, DYip, HTraeger, SCZhang, YMathur, AZhang, HHuang, CYang, ZRanasinghe, AEverlof, GRaghavan, NTye, CKWee, SHunt, JTVite, GWesthouse, RLee, FY Discovery and Preclinical Pharmacology of an Oral Bromodomain and Extra-Terminal (BET) Inhibitor Using Scaffold-Hopping and Structure-Guided Drug Design. J Med Chem 64:14247-14265 (2021)  
Target
Name:
Bromodomain-containing protein 2
Synonyms:
BRD2 Bromodomain and extra-terminal motif (BET) Bromodomain-containing protein 2 (BRD2) RING3
Type:
Protein
Mol. Mass.:
88085.95
Organism:
Homo sapiens (Human)
Description:
P25440
Residue:
801
  
Inhibitor
Name:
BDBM296886
Synonyms:
2-[3-(Dimethyl-1,2-oxazol-4-yl)-5-[oxan-4-yl(phenyl)methyl]-5H-pyrido[3,2-b]indol-7-yl]propan-2-ol US10112941, Example 192
Type:
Small organic molecule
Emp. Form.:
C31H33N3O3
Mol. Mass.:
495.612
SMILES:
Cc1noc(C)c1-c1cnc2c(c1)n([C@@H](C1CCOCC1)c1ccccc1)c1cc(ccc21)C(C)(C)O
: